{"text_format":"1","workbook":"xlsx","n_sheets":7,"sheets":["問題作成_説明中心_1","問題作成_説明中心_2","問題作成_説明中心_3","問題作成_説明中心_4","問題作成_説明中心_5","問題作成_用語中心","用語表"],"not_rendered":{"charts":0,"images":29,"macros":1,"external_links":0,"defined_names":0,"comments":0,"pivot_tables":0},"unopened":[],"bounds":{"document_bytes":16777216,"sheet_cells":100000,"rows_first":2000,"rows_last":500,"rows_between":2000,"halvings":0,"cell_chars":16384,"cell_head_chars":4096},"cells_cut":0,"cells_raw":0,"read":"whole","date_system":"1900"}

{"sheet":"問題作成_説明中心_1","index":0,"n_rows":163,"n_cols":14,"rows_kept":163,"cut":false,"hidden":false,"merged":[[36,1,36,8],[0,1,0,10],[1,1,1,10],[33,1,33,8],[34,1,34,8],[35,1,35,8],[37,1,37,8],[38,1,38,8],[41,1,41,8],[42,1,42,8],[39,1,39,8],[40,1,40,8]]}
[null,"ITパスポート試験　用語確認問題"]
[null,"　　　年　　　組　　　席　名前"]
[]
[1,{"$f":"IF(ISERROR(VLOOKUP(A4,用語表!$C$3:$E$310,3,0)),\"\",VLOOKUP(A4,用語表!$C$3:$E$310,3,0))","v":"５大装置"},null,{"$f":"A31+1","v":29},{"$f":"IF(ISERROR(VLOOKUP(D4,用語表!$C$3:$E$310,3,0)),\"\",VLOOKUP(D4,用語表!$C$3:$E$310,3,0))","v":"ＳＳＤ"},null,{"$f":"D31+1","v":57},{"$f":"IF(ISERROR(VLOOKUP(G4,用語表!$C$3:$E$310,3,0)),\"\",VLOOKUP(G4,用語表!$C$3:$E$310,3,0))","v":"ターンアラウンドタイム"},null,{"$f":"G31+1","v":85},{"$f":"IF(ISERROR(VLOOKUP(J4,用語表!$C$3:$E$310,3,0)),\"\",VLOOKUP(J4,用語表!$C$3:$E$310,3,0))","v":"ＩＴＦ"}]
[{"$f":"A4+1","v":2},{"$f":"IF(ISERROR(VLOOKUP(A5,用語表!$C$3:$E$310,3,0)),\"\",VLOOKUP(A5,用語表!$C$3:$E$310,3,0))","v":"ＣＰＵ"},null,{"$f":"D4+1","v":30},{"$f":"IF(ISERROR(VLOOKUP(D5,用語表!$C$3:$E$310,3,0)),\"\",VLOOKUP(D5,用語表!$C$3:$E$310,3,0))","v":"シリアルインターフェース"},null,{"$f":"G4+1","v":58},{"$f":"IF(ISERROR(VLOOKUP(G5,用語表!$C$3:$E$310,3,0)),\"\",VLOOKUP(G5,用語表!$C$3:$E$310,3,0))","v":"ベンチマークテスト"},null,{"$f":"J4+1","v":86},{"$f":"IF(ISERROR(VLOOKUP(J5,用語表!$C$3:$E$310,3,0)),\"\",VLOOKUP(J5,用語表!$C$3:$E$310,3,0))","v":"インタプリタ"}]
[{"$f":"A5+1","v":3},{"$f":"IF(ISERROR(VLOOKUP(A6,用語表!$C$3:$E$310,3,0)),\"\",VLOOKUP(A6,用語表!$C$3:$E$310,3,0))","v":"マイクロプロセッサ"},null,{"$f":"D5+1","v":31},{"$f":"IF(ISERROR(VLOOKUP(D6,用語表!$C$3:$E$310,3,0)),\"\",VLOOKUP(D6,用語表!$C$3:$E$310,3,0))","v":"パラレルインターフェース"},null,{"$f":"G5+1","v":59},{"$f":"IF(ISERROR(VLOOKUP(G6,用語表!$C$3:$E$310,3,0)),\"\",VLOOKUP(G6,用語表!$C$3:$E$310,3,0))","v":"ＲＡＳＩＳ"},null,{"$f":"J5+1","v":87},{"$f":"IF(ISERROR(VLOOKUP(J6,用語表!$C$3:$E$310,3,0)),\"\",VLOOKUP(J6,用語表!$C$3:$E$310,3,0))","v":"ｄｐｉ"}]
[4,{"$f":"IF(ISERROR(VLOOKUP(A7,用語表!$C$3:$E$310,3,0)),\"\",VLOOKUP(A7,用語表!$C$3:$E$310,3,0))","v":"プログラム内蔵方式"},null,32,{"$f":"IF(ISERROR(VLOOKUP(D7,用語表!$C$3:$E$310,3,0)),\"\",VLOOKUP(D7,用語表!$C$3:$E$310,3,0))","v":"ＰＤＡ"},null,60,{"$f":"IF(ISERROR(VLOOKUP(G7,用語表!$C$3:$E$310,3,0)),\"\",VLOOKUP(G7,用語表!$C$3:$E$310,3,0))","v":"稼働率"},null,88,{"$f":"IF(ISERROR(VLOOKUP(J7,用語表!$C$3:$E$310,3,0)),\"\",VLOOKUP(J7,用語表!$C$3:$E$310,3,0))","v":"ｐｐｍ"}]
[5,{"$f":"IF(ISERROR(VLOOKUP(A8,用語表!$C$3:$E$310,3,0)),\"\",VLOOKUP(A8,用語表!$C$3:$E$310,3,0))","v":"逐次制御方式"},null,33,{"$f":"IF(ISERROR(VLOOKUP(D8,用語表!$C$3:$E$310,3,0)),\"\",VLOOKUP(D8,用語表!$C$3:$E$310,3,0))","v":"ＩｒＤＡ"},null,61,{"$f":"IF(ISERROR(VLOOKUP(G8,用語表!$C$3:$E$310,3,0)),\"\",VLOOKUP(G8,用語表!$C$3:$E$310,3,0))","v":"平均故障間隔（MTBF)"},null,89,{"$f":"IF(ISERROR(VLOOKUP(J8,用語表!$C$3:$E$310,3,0)),\"\",VLOOKUP(J8,用語表!$C$3:$E$310,3,0))","v":"ハイバネーション(休止状態)"}]
[6,{"$f":"IF(ISERROR(VLOOKUP(A9,用語表!$C$3:$E$310,3,0)),\"\",VLOOKUP(A9,用語表!$C$3:$E$310,3,0))","v":"クロック"},null,34,{"$f":"IF(ISERROR(VLOOKUP(D9,用語表!$C$3:$E$310,3,0)),\"\",VLOOKUP(D9,用語表!$C$3:$E$310,3,0))","v":"Ｂｌｕｅｔｏｏｔｈ"},null,62,{"$f":"IF(ISERROR(VLOOKUP(G9,用語表!$C$3:$E$310,3,0)),\"\",VLOOKUP(G9,用語表!$C$3:$E$310,3,0))","v":"平均修復時間（MTTR)"},null,90,{"$f":"IF(ISERROR(VLOOKUP(J9,用語表!$C$3:$E$310,3,0)),\"\",VLOOKUP(J9,用語表!$C$3:$E$310,3,0))","v":"スタンバイ"}]
[7,{"$f":"IF(ISERROR(VLOOKUP(A10,用語表!$C$3:$E$310,3,0)),\"\",VLOOKUP(A10,用語表!$C$3:$E$310,3,0))","v":"MIPS"},null,35,{"$f":"IF(ISERROR(VLOOKUP(D10,用語表!$C$3:$E$310,3,0)),\"\",VLOOKUP(D10,用語表!$C$3:$E$310,3,0))","v":"ＡＴＡ"},null,63,{"$f":"IF(ISERROR(VLOOKUP(G10,用語表!$C$3:$E$310,3,0)),\"\",VLOOKUP(G10,用語表!$C$3:$E$310,3,0))","v":"バスタブ曲線"},null,91,{"$f":"IF(ISERROR(VLOOKUP(J10,用語表!$C$3:$E$310,3,0)),\"\",VLOOKUP(J10,用語表!$C$3:$E$310,3,0))","v":"ＧＵＩ"}]
{"$rows_left_out":154}
{"sheet":"問題作成_説明中心_2","index":1,"n_rows":153,"n_cols":14,"rows_kept":153,"cut":false,"hidden":false,"merged":[[44,4,50,10],[36,1,36,8],[0,1,0,10],[1,1,1,10],[33,1,33,8],[34,1,34,8],[35,1,35,8],[41,1,41,8],[42,1,42,8],[39,1,39,8],[40,1,40,8],[37,1,37,8],[38,1,38,8]]}
[null,"ITパスポート試験　用語確認問題"]
[null,"　　　年　　　組　　　席　名前"]
[]
[113,{"$f":"IF(ISERROR(VLOOKUP(A4,用語表!$C$3:$E$310,3,0)),\"\",VLOOKUP(A4,用語表!$C$3:$E$310,3,0))","v":"VRML"},null,{"$f":"A31+1","v":141},{"$f":"IF(ISERROR(VLOOKUP(D4,用語表!$C$3:$E$310,3,0)),\"\",VLOOKUP(D4,用語表!$C$3:$E$310,3,0))","v":"結合"},null,{"$f":"D31+1","v":169},{"$f":"IF(ISERROR(VLOOKUP(G4,用語表!$C$3:$E$310,3,0)),\"\",VLOOKUP(G4,用語表!$C$3:$E$310,3,0))","v":"HTTP"},null,{"$f":"G31+1","v":197},{"$f":"IF(ISERROR(VLOOKUP(J4,用語表!$C$3:$E$464,3,0)),\"\",VLOOKUP(J4,用語表!$C$3:$E$464,3,0))","v":"クロスサイトスクリプティング"}]
[{"$f":"A4+1","v":114},{"$f":"IF(ISERROR(VLOOKUP(A5,用語表!$C$3:$E$310,3,0)),\"\",VLOOKUP(A5,用語表!$C$3:$E$310,3,0))","v":"ＭＩＤＩ"},null,{"$f":"D4+1","v":142},{"$f":"IF(ISERROR(VLOOKUP(D5,用語表!$C$3:$E$310,3,0)),\"\",VLOOKUP(D5,用語表!$C$3:$E$310,3,0))","v":"ロールバック"},null,{"$f":"G4+1","v":170},{"$f":"IF(ISERROR(VLOOKUP(G5,用語表!$C$3:$E$310,3,0)),\"\",VLOOKUP(G5,用語表!$C$3:$E$310,3,0))","v":"FTP"},null,{"$f":"J4+1","v":198},{"$f":"IF(ISERROR(VLOOKUP(J5,用語表!$C$3:$E$464,3,0)),\"\",VLOOKUP(J5,用語表!$C$3:$E$464,3,0))","v":"セッションハイジャック"}]
[{"$f":"A5+1","v":115},{"$f":"IF(ISERROR(VLOOKUP(A6,用語表!$C$3:$E$310,3,0)),\"\",VLOOKUP(A6,用語表!$C$3:$E$310,3,0))","v":"キャプチャカード"},null,{"$f":"D5+1","v":143},{"$f":"IF(ISERROR(VLOOKUP(D6,用語表!$C$3:$E$310,3,0)),\"\",VLOOKUP(D6,用語表!$C$3:$E$310,3,0))","v":"ロールフォワード"},null,{"$f":"G5+1","v":171},{"$f":"IF(ISERROR(VLOOKUP(G6,用語表!$C$3:$E$310,3,0)),\"\",VLOOKUP(G6,用語表!$C$3:$E$310,3,0))","v":"IPアドレス"},null,199,{"$f":"IF(ISERROR(VLOOKUP(J6,用語表!$C$3:$E$464,3,0)),\"\",VLOOKUP(J6,用語表!$C$3:$E$464,3,0))","v":"SQLインジェクション"}]
[116,{"$f":"IF(ISERROR(VLOOKUP(A7,用語表!$C$3:$E$310,3,0)),\"\",VLOOKUP(A7,用語表!$C$3:$E$310,3,0))","v":"DTMソフト"},null,144,{"$f":"IF(ISERROR(VLOOKUP(D7,用語表!$C$3:$E$310,3,0)),\"\",VLOOKUP(D7,用語表!$C$3:$E$310,3,0))","v":"データウェアハウス"},null,172,{"$f":"IF(ISERROR(VLOOKUP(G7,用語表!$C$3:$E$310,3,0)),\"\",VLOOKUP(G7,用語表!$C$3:$E$310,3,0))","v":"プライベートIPアドレス"},null,200,{"$f":"IF(ISERROR(VLOOKUP(J7,用語表!$C$3:$E$464,3,0)),\"\",VLOOKUP(J7,用語表!$C$3:$E$464,3,0))","v":"フィッシング"}]
[117,{"$f":"IF(ISERROR(VLOOKUP(A8,用語表!$C$3:$E$310,3,0)),\"\",VLOOKUP(A8,用語表!$C$3:$E$310,3,0))","v":"エージェントソフトウェア"},null,145,{"$f":"IF(ISERROR(VLOOKUP(D8,用語表!$C$3:$E$310,3,0)),\"\",VLOOKUP(D8,用語表!$C$3:$E$310,3,0))","v":"データマート"},null,173,{"$f":"IF(ISERROR(VLOOKUP(G8,用語表!$C$3:$E$310,3,0)),\"\",VLOOKUP(G8,用語表!$C$3:$E$310,3,0))","v":"グローバルIPアドレス"},null,201,{"$f":"IF(ISERROR(VLOOKUP(J8,用語表!$C$3:$E$464,3,0)),\"\",VLOOKUP(J8,用語表!$C$3:$E$464,3,0))","v":"コンテンツフィルタリング"}]
[118,{"$f":"IF(ISERROR(VLOOKUP(A9,用語表!$C$3:$E$310,3,0)),\"\",VLOOKUP(A9,用語表!$C$3:$E$310,3,0))","v":"ノンリニア編集"},null,146,{"$f":"IF(ISERROR(VLOOKUP(D9,用語表!$C$3:$E$310,3,0)),\"\",VLOOKUP(D9,用語表!$C$3:$E$310,3,0))","v":"データマイニング"},null,174,{"$f":"IF(ISERROR(VLOOKUP(G9,用語表!$C$3:$E$310,3,0)),\"\",VLOOKUP(G9,用語表!$C$3:$E$310,3,0))","v":"サブネットマスク"},null,202,{"$f":"IF(ISERROR(VLOOKUP(J9,用語表!$C$3:$E$464,3,0)),\"\",VLOOKUP(J9,用語表!$C$3:$E$464,3,0))","v":"脆弱性"}]
[119,{"$f":"IF(ISERROR(VLOOKUP(A10,用語表!$C$3:$E$310,3,0)),\"\",VLOOKUP(A10,用語表!$C$3:$E$310,3,0))","v":"リレーショナルデータベース"},null,147,{"$f":"IF(ISERROR(VLOOKUP(D10,用語表!$C$3:$E$310,3,0)),\"\",VLOOKUP(D10,用語表!$C$3:$E$310,3,0))","v":"リポジトリ　"},null,175,{"$f":"IF(ISERROR(VLOOKUP(G10,用語表!$C$3:$E$310,3,0)),\"\",VLOOKUP(G10,用語表!$C$3:$E$310,3,0))","v":"ネットワークアドレス"},null,203,{"$f":"IF(ISERROR(VLOOKUP(J10,用語表!$C$3:$E$464,3,0)),\"\",VLOOKUP(J10,用語表!$C$3:$E$464,3,0))","v":"セキュリティポリシ"}]
{"$rows_left_out":144}
{"sheet":"問題作成_説明中心_3","index":2,"n_rows":123,"n_cols":14,"rows_kept":123,"cut":false,"hidden":false,"merged":[[36,1,36,8],[41,1,41,8],[42,1,42,8],[39,1,39,8],[40,1,40,8],[37,1,37,8],[38,1,38,8],[0,1,0,10],[1,1,1,10],[33,1,33,8],[34,1,34,8],[35,1,35,8]]}
[null,"ITパスポート試験　用語確認問題"]
[null,"　　　年　　　組　　　席　名前"]
[]
[225,{"$f":"IF(ISERROR(VLOOKUP(A4,用語表!$C$3:$E$310,3,0)),\"\",VLOOKUP(A4,用語表!$C$3:$E$310,3,0))","v":"共通鍵暗号方式"},null,{"$f":"A31+1","v":253},{"$f":"IF(ISERROR(VLOOKUP(D4,用語表!$C$3:$E$310,3,0)),\"\",VLOOKUP(D4,用語表!$C$3:$E$310,3,0))","v":"ＰＤＣＡサイクル"},null,{"$f":"D31+1","v":281},{"$f":"IF(ISERROR(VLOOKUP(G4,用語表!$C$3:$E$602,3,0)),\"\",VLOOKUP(G4,用語表!$C$3:$E$602,3,0))","v":"リードタイム"},null,{"$f":"G31+1","v":309},{"$f":"IF(ISERROR(VLOOKUP(J4,用語表!$C$3:$E$602,3,0)),\"\",VLOOKUP(J4,用語表!$C$3:$E$602,3,0))","v":"実用新案権"}]
[{"$f":"A4+1","v":226},{"$f":"IF(ISERROR(VLOOKUP(A5,用語表!$C$3:$E$310,3,0)),\"\",VLOOKUP(A5,用語表!$C$3:$E$310,3,0))","v":"公開鍵暗号方式"},null,{"$f":"D4+1","v":254},{"$f":"IF(ISERROR(VLOOKUP(D5,用語表!$C$3:$E$310,3,0)),\"\",VLOOKUP(D5,用語表!$C$3:$E$310,3,0))","v":"プロジェクト制組織"},null,{"$f":"G4+1","v":282},{"$f":"IF(ISERROR(VLOOKUP(G5,用語表!$C$3:$E$602,3,0)),\"\",VLOOKUP(G5,用語表!$C$3:$E$602,3,0))","v":"回帰分析"},null,{"$f":"J4+1","v":310},{"$f":"IF(ISERROR(VLOOKUP(J5,用語表!$C$3:$E$602,3,0)),\"\",VLOOKUP(J5,用語表!$C$3:$E$602,3,0))","v":"意匠権"}]
[227,{"$f":"IF(ISERROR(VLOOKUP(A6,用語表!$C$3:$E$310,3,0)),\"\",VLOOKUP(A6,用語表!$C$3:$E$310,3,0))","v":"SSL"},null,255,{"$f":"IF(ISERROR(VLOOKUP(D6,用語表!$C$3:$E$310,3,0)),\"\",VLOOKUP(D6,用語表!$C$3:$E$310,3,0))","v":"マトリックス組織"},null,283,{"$f":"IF(ISERROR(VLOOKUP(G6,用語表!$C$3:$E$602,3,0)),\"\",VLOOKUP(G6,用語表!$C$3:$E$602,3,0))","v":"損益計算書"},null,{"$f":"J5+1","v":311},{"$f":"IF(ISERROR(VLOOKUP(J6,用語表!$C$3:$E$602,3,0)),\"\",VLOOKUP(J6,用語表!$C$3:$E$602,3,0))","v":"商標権"}]
[228,{"$f":"IF(ISERROR(VLOOKUP(A7,用語表!$C$3:$E$310,3,0)),\"\",VLOOKUP(A7,用語表!$C$3:$E$310,3,0))","v":"シングルサインオン"},null,256,{"$f":"IF(ISERROR(VLOOKUP(D7,用語表!$C$3:$E$310,3,0)),\"\",VLOOKUP(D7,用語表!$C$3:$E$310,3,0))","v":"持株会社(ホールディングカンパニー)"},null,284,{"$f":"IF(ISERROR(VLOOKUP(G7,用語表!$C$3:$E$602,3,0)),\"\",VLOOKUP(G7,用語表!$C$3:$E$602,3,0))","v":"貸借対照表"},null,312,{"$f":"IF(ISERROR(VLOOKUP(J7,用語表!$C$3:$E$602,3,0)),\"\",VLOOKUP(J7,用語表!$C$3:$E$602,3,0))","v":"クロスライセンス"}]
[229,{"$f":"IF(ISERROR(VLOOKUP(A8,用語表!$C$3:$E$310,3,0)),\"\",VLOOKUP(A8,用語表!$C$3:$E$310,3,0))","v":"ワンタイムパスワード"},null,257,{"$f":"IF(ISERROR(VLOOKUP(D8,用語表!$C$3:$E$310,3,0)),\"\",VLOOKUP(D8,用語表!$C$3:$E$310,3,0))","v":"QCサークル"},null,285,{"$f":"IF(ISERROR(VLOOKUP(G8,用語表!$C$3:$E$602,3,0)),\"\",VLOOKUP(G8,用語表!$C$3:$E$602,3,0))","v":"資本回転率"},null,313,{"$f":"IF(ISERROR(VLOOKUP(J8,用語表!$C$3:$E$602,3,0)),\"\",VLOOKUP(J8,用語表!$C$3:$E$602,3,0))","v":"不正競争防止法"}]
[230,{"$f":"IF(ISERROR(VLOOKUP(A9,用語表!$C$3:$E$310,3,0)),\"\",VLOOKUP(A9,用語表!$C$3:$E$310,3,0))","v":"TKIP"},null,258,{"$f":"IF(ISERROR(VLOOKUP(D9,用語表!$C$3:$E$310,3,0)),\"\",VLOOKUP(D9,用語表!$C$3:$E$310,3,0))","v":"TQC"},null,286,{"$f":"IF(ISERROR(VLOOKUP(G9,用語表!$C$3:$E$602,3,0)),\"\",VLOOKUP(G9,用語表!$C$3:$E$602,3,0))","v":"流動比率"},null,314,{"$f":"IF(ISERROR(VLOOKUP(J9,用語表!$C$3:$E$602,3,0)),\"\",VLOOKUP(J9,用語表!$C$3:$E$602,3,0))","v":"不正アクセス禁止法"}]
[231,{"$f":"IF(ISERROR(VLOOKUP(A10,用語表!$C$3:$E$310,3,0)),\"\",VLOOKUP(A10,用語表!$C$3:$E$310,3,0))","v":"タイムスタンプ"},null,259,{"$f":"IF(ISERROR(VLOOKUP(D10,用語表!$C$3:$E$310,3,0)),\"\",VLOOKUP(D10,用語表!$C$3:$E$310,3,0))","v":"Ｘバー管理図"},null,287,{"$f":"IF(ISERROR(VLOOKUP(G10,用語表!$C$3:$E$602,3,0)),\"\",VLOOKUP(G10,用語表!$C$3:$E$602,3,0))","v":"キャッシュフロー計算書"},null,315,{"$f":"IF(ISERROR(VLOOKUP(J10,用語表!$C$3:$E$602,3,0)),\"\",VLOOKUP(J10,用語表!$C$3:$E$602,3,0))","v":"個人情報保護法"}]
{"$rows_left_out":114}
{"sheet":"問題作成_説明中心_4","index":3,"n_rows":133,"n_cols":14,"rows_kept":133,"cut":false,"hidden":false,"merged":[[36,1,36,8],[0,1,0,10],[1,1,1,10],[33,1,33,8],[34,1,34,8],[35,1,35,8],[41,1,41,8],[42,1,42,8],[39,1,39,8],[40,1,40,8],[37,1,37,8],[38,1,38,8]]}
[null,"ITパスポート試験　用語確認問題"]
[null,"　　　年　　　組　　　席　名前"]
[]
[388,{"$f":"IF(ISERROR(VLOOKUP(A4,用語表!$C$3:$E$602,3,0)),\"\",VLOOKUP(A4,用語表!$C$3:$E$602,3,0))","v":"ＰＯＳ"},null,{"$f":"A31+1","v":416},{"$f":"IF(ISERROR(VLOOKUP(D4,用語表!$C$3:$E$602,3,0)),\"\",VLOOKUP(D4,用語表!$C$3:$E$602,3,0))","v":"ユビキタスコンピューティング"},null,{"$f":"D31+1","v":444},{"$f":"IF(ISERROR(VLOOKUP(G4,用語表!$C$3:$E$602,3,0)),\"\",VLOOKUP(G4,用語表!$C$3:$E$602,3,0))","v":"ファブレス"},null,{"$f":"G31+1","v":472},{"$f":"IF(ISERROR(VLOOKUP(J4,用語表!$C$3:$E$602,3,0)),\"\",VLOOKUP(J4,用語表!$C$3:$E$602,3,0))","v":"RAD"}]
[{"$f":"A4+1","v":389},{"$f":"IF(ISERROR(VLOOKUP(A5,用語表!$C$3:$E$602,3,0)),\"\",VLOOKUP(A5,用語表!$C$3:$E$602,3,0))","v":"ＪＡＮコード"},null,{"$f":"D4+1","v":417},{"$f":"IF(ISERROR(VLOOKUP(D5,用語表!$C$3:$E$602,3,0)),\"\",VLOOKUP(D5,用語表!$C$3:$E$602,3,0))","v":"アクセシビリティ"},null,{"$f":"G4+1","v":445},{"$f":"IF(ISERROR(VLOOKUP(G5,用語表!$C$3:$E$602,3,0)),\"\",VLOOKUP(G5,用語表!$C$3:$E$602,3,0))","v":"ファウンドリ"},null,{"$f":"J4+1","v":473},{"$f":"IF(ISERROR(VLOOKUP(J5,用語表!$C$3:$E$602,3,0)),\"\",VLOOKUP(J5,用語表!$C$3:$E$602,3,0))","v":"CASEツール"}]
[390,{"$f":"IF(ISERROR(VLOOKUP(A6,用語表!$C$3:$E$602,3,0)),\"\",VLOOKUP(A6,用語表!$C$3:$E$602,3,0))","v":"ＩＴＦ"},null,418,{"$f":"IF(ISERROR(VLOOKUP(D6,用語表!$C$3:$E$602,3,0)),\"\",VLOOKUP(D6,用語表!$C$3:$E$602,3,0))","v":"バーチャルリアリティ"},null,446,{"$f":"IF(ISERROR(VLOOKUP(G6,用語表!$C$3:$E$602,3,0)),\"\",VLOOKUP(G6,用語表!$C$3:$E$602,3,0))","v":"ＥＭＳ"},null,474,{"$f":"IF(ISERROR(VLOOKUP(J6,用語表!$C$3:$E$602,3,0)),\"\",VLOOKUP(J6,用語表!$C$3:$E$602,3,0))","v":"構造化手法"}]
[391,{"$f":"IF(ISERROR(VLOOKUP(A7,用語表!$C$3:$E$602,3,0)),\"\",VLOOKUP(A7,用語表!$C$3:$E$602,3,0))","v":"ＥＯＳ"},null,419,{"$f":"IF(ISERROR(VLOOKUP(D7,用語表!$C$3:$E$602,3,0)),\"\",VLOOKUP(D7,用語表!$C$3:$E$602,3,0))","v":"ディジタルディバイド"},null,447,{"$f":"IF(ISERROR(VLOOKUP(G7,用語表!$C$3:$E$602,3,0)),\"\",VLOOKUP(G7,用語表!$C$3:$E$602,3,0))","v":"ISP"},null,475,{"$f":"IF(ISERROR(VLOOKUP(J7,用語表!$C$3:$E$602,3,0)),\"\",VLOOKUP(J7,用語表!$C$3:$E$602,3,0))","v":"CMMＩ"}]
[392,{"$f":"IF(ISERROR(VLOOKUP(A8,用語表!$C$3:$E$602,3,0)),\"\",VLOOKUP(A8,用語表!$C$3:$E$602,3,0))","v":"ＲＦＩＤ"},null,420,{"$f":"IF(ISERROR(VLOOKUP(D8,用語表!$C$3:$E$602,3,0)),\"\",VLOOKUP(D8,用語表!$C$3:$E$602,3,0))","v":"クラウドコンピューティング"},null,448,{"$f":"IF(ISERROR(VLOOKUP(G8,用語表!$C$3:$E$602,3,0)),\"\",VLOOKUP(G8,用語表!$C$3:$E$602,3,0))","v":"システム化計画"},null,476,{"$f":"IF(ISERROR(VLOOKUP(J8,用語表!$C$3:$E$602,3,0)),\"\",VLOOKUP(J8,用語表!$C$3:$E$602,3,0))","v":"プロセス中心設計（ＰＯＡ）"}]
[393,{"$f":"IF(ISERROR(VLOOKUP(A9,用語表!$C$3:$E$602,3,0)),\"\",VLOOKUP(A9,用語表!$C$3:$E$602,3,0))","v":"ＩＣカード"},null,421,{"$f":"IF(ISERROR(VLOOKUP(D9,用語表!$C$3:$E$602,3,0)),\"\",VLOOKUP(D9,用語表!$C$3:$E$602,3,0))","v":"ビジネスモデル"},null,449,{"$f":"IF(ISERROR(VLOOKUP(G9,用語表!$C$3:$E$602,3,0)),\"\",VLOOKUP(G9,用語表!$C$3:$E$602,3,0))","v":"要求定義"},null,477,{"$f":"IF(ISERROR(VLOOKUP(J9,用語表!$C$3:$E$602,3,0)),\"\",VLOOKUP(J9,用語表!$C$3:$E$602,3,0))","v":"データ中心設計（ＤＯＡ）"}]
[394,{"$f":"IF(ISERROR(VLOOKUP(A10,用語表!$C$3:$E$602,3,0)),\"\",VLOOKUP(A10,用語表!$C$3:$E$602,3,0))","v":"ＰＡＳＭＯ"},null,422,{"$f":"IF(ISERROR(VLOOKUP(D10,用語表!$C$3:$E$602,3,0)),\"\",VLOOKUP(D10,用語表!$C$3:$E$602,3,0))","v":"ビジネスプロセスモデル"},null,450,{"$f":"IF(ISERROR(VLOOKUP(G10,用語表!$C$3:$E$602,3,0)),\"\",VLOOKUP(G10,用語表!$C$3:$E$602,3,0))","v":"ＲＦＩ"},null,478,{"$f":"IF(ISERROR(VLOOKUP(J10,用語表!$C$3:$E$602,3,0)),\"\",VLOOKUP(J10,用語表!$C$3:$E$602,3,0))","v":"オブジェクト指向設計"}]
{"$rows_left_out":124}
{"sheet":"問題作成_説明中心_5","index":4,"n_rows":123,"n_cols":14,"rows_kept":123,"cut":false,"hidden":false,"merged":[[36,1,36,8],[41,1,41,8],[42,1,42,8],[39,1,39,8],[40,1,40,8],[37,1,37,8],[38,1,38,8],[0,1,0,10],[1,1,1,10],[33,1,33,8],[34,1,34,8],[35,1,35,8]]}
[null,"ITパスポート試験　用語確認問題"]
[null,"　　　年　　　組　　　席　名前"]
[]
[452,{"$f":"IF(ISERROR(VLOOKUP(A4,用語表!$C$3:$E$602,3,0)),\"\",VLOOKUP(A4,用語表!$C$3:$E$602,3,0))","v":"システム方式設計"},null,{"$f":"A31+1","v":480},{"$f":"IF(ISERROR(VLOOKUP(D4,用語表!$C$3:$E$602,3,0)),\"\",VLOOKUP(D4,用語表!$C$3:$E$602,3,0))","v":"プロジェクト"},null,{"$f":"D31+1","v":508},{"$f":"IF(ISERROR(VLOOKUP(G4,用語表!$C$3:$E$602,3,0)),\"\",VLOOKUP(G4,用語表!$C$3:$E$602,3,0))","v":"内部統制"},null,{"$f":"G31+1","v":536},{"$f":"IF(ISERROR(VLOOKUP(J4,用語表!$C$3:$E$602,3,0)),\"\",VLOOKUP(J4,用語表!$C$3:$E$602,3,0))","v":""}]
[{"$f":"A4+1","v":453},{"$f":"IF(ISERROR(VLOOKUP(A5,用語表!$C$3:$E$602,3,0)),\"\",VLOOKUP(A5,用語表!$C$3:$E$602,3,0))","v":"ソフトウェア方式設計"},null,{"$f":"D4+1","v":481},{"$f":"IF(ISERROR(VLOOKUP(D5,用語表!$C$3:$E$602,3,0)),\"\",VLOOKUP(D5,用語表!$C$3:$E$602,3,0))","v":"プロジェクトマネージャー"},null,{"$f":"G4+1","v":509},{"$f":"IF(ISERROR(VLOOKUP(G5,用語表!$C$3:$E$602,3,0)),\"\",VLOOKUP(G5,用語表!$C$3:$E$602,3,0))","v":"コンプライアンス"},null,{"$f":"J4+1","v":537},{"$f":"IF(ISERROR(VLOOKUP(J5,用語表!$C$3:$E$602,3,0)),\"\",VLOOKUP(J5,用語表!$C$3:$E$602,3,0))","v":""}]
[454,{"$f":"IF(ISERROR(VLOOKUP(A6,用語表!$C$3:$E$602,3,0)),\"\",VLOOKUP(A6,用語表!$C$3:$E$602,3,0))","v":"ソフトウェア詳細設計"},null,482,{"$f":"IF(ISERROR(VLOOKUP(D6,用語表!$C$3:$E$602,3,0)),\"\",VLOOKUP(D6,用語表!$C$3:$E$602,3,0))","v":"ＰＤＣＡサイクル"},null,510,{"$f":"IF(ISERROR(VLOOKUP(G6,用語表!$C$3:$E$602,3,0)),\"\",VLOOKUP(G6,用語表!$C$3:$E$602,3,0))","v":"ＣＯＳＯ"},null,538,{"$f":"IF(ISERROR(VLOOKUP(J6,用語表!$C$3:$E$602,3,0)),\"\",VLOOKUP(J6,用語表!$C$3:$E$602,3,0))","v":""}]
[455,{"$f":"IF(ISERROR(VLOOKUP(A7,用語表!$C$3:$E$602,3,0)),\"\",VLOOKUP(A7,用語表!$C$3:$E$602,3,0))","v":"ソフトウェア保守"},null,483,{"$f":"IF(ISERROR(VLOOKUP(D7,用語表!$C$3:$E$602,3,0)),\"\",VLOOKUP(D7,用語表!$C$3:$E$602,3,0))","v":"PDPC"},null,511,{"$f":"IF(ISERROR(VLOOKUP(G7,用語表!$C$3:$E$602,3,0)),\"\",VLOOKUP(G7,用語表!$C$3:$E$602,3,0))","v":"ＩＴガバナンス"},null,539,{"$f":"IF(ISERROR(VLOOKUP(J7,用語表!$C$3:$E$602,3,0)),\"\",VLOOKUP(J7,用語表!$C$3:$E$602,3,0))","v":""}]
[456,{"$f":"IF(ISERROR(VLOOKUP(A8,用語表!$C$3:$E$602,3,0)),\"\",VLOOKUP(A8,用語表!$C$3:$E$602,3,0))","v":"単体テスト"},null,484,{"$f":"IF(ISERROR(VLOOKUP(D8,用語表!$C$3:$E$602,3,0)),\"\",VLOOKUP(D8,用語表!$C$3:$E$602,3,0))","v":"ステークホルダ"},null,512,{"$f":"IF(ISERROR(VLOOKUP(G8,用語表!$C$3:$E$602,3,0)),\"\",VLOOKUP(G8,用語表!$C$3:$E$602,3,0))","v":"基数変換"},null,540,{"$f":"IF(ISERROR(VLOOKUP(J8,用語表!$C$3:$E$602,3,0)),\"\",VLOOKUP(J8,用語表!$C$3:$E$602,3,0))","v":""}]
[457,{"$f":"IF(ISERROR(VLOOKUP(A9,用語表!$C$3:$E$602,3,0)),\"\",VLOOKUP(A9,用語表!$C$3:$E$602,3,0))","v":"ホワイトボックステスト"},null,485,{"$f":"IF(ISERROR(VLOOKUP(D9,用語表!$C$3:$E$602,3,0)),\"\",VLOOKUP(D9,用語表!$C$3:$E$602,3,0))","v":"インセンティブ"},null,513,{"$f":"IF(ISERROR(VLOOKUP(G9,用語表!$C$3:$E$602,3,0)),\"\",VLOOKUP(G9,用語表!$C$3:$E$602,3,0))","v":"二の補数"},null,541,{"$f":"IF(ISERROR(VLOOKUP(J9,用語表!$C$3:$E$602,3,0)),\"\",VLOOKUP(J9,用語表!$C$3:$E$602,3,0))","v":""}]
[458,{"$f":"IF(ISERROR(VLOOKUP(A10,用語表!$C$3:$E$602,3,0)),\"\",VLOOKUP(A10,用語表!$C$3:$E$602,3,0))","v":"ブラックボックステスト"},null,486,{"$f":"IF(ISERROR(VLOOKUP(D10,用語表!$C$3:$E$602,3,0)),\"\",VLOOKUP(D10,用語表!$C$3:$E$602,3,0))","v":"ＰＭＢＯＫ"},null,514,{"$f":"IF(ISERROR(VLOOKUP(G10,用語表!$C$3:$E$602,3,0)),\"\",VLOOKUP(G10,用語表!$C$3:$E$602,3,0))","v":"論理積"},null,542,{"$f":"IF(ISERROR(VLOOKUP(J10,用語表!$C$3:$E$602,3,0)),\"\",VLOOKUP(J10,用語表!$C$3:$E$602,3,0))","v":""}]
{"$rows_left_out":114}
{"sheet":"問題作成_用語中心","index":5,"n_rows":93,"n_cols":14,"rows_kept":93,"cut":false,"hidden":false,"merged":[[37,2,37,5],[42,2,42,5],[41,2,41,5],[40,2,40,5],[39,2,39,5],[38,2,38,5],[0,2,0,11],[1,2,1,11],[33,2,33,5],[34,2,34,5],[36,2,36,5],[35,2,35,5]]}
[null,null,"ITパスポート試験　用語確認問題"]
[null,null,"　　　年　　　組　　　席　名前"]
[]
[null,1,null,null,29,null,null,57,null,null,85]
[null,2,null,null,30,null,null,58,null,null,86]
[null,3,null,null,31,null,null,59,null,null,87]
[null,4,null,null,32,null,null,60,null,null,88]
[null,5,null,null,33,null,null,61,null,null,89]
[null,6,null,null,34,null,null,62,null,null,90]
[null,7,null,null,35,null,null,63,null,null,91]
{"$rows_left_out":84}
{"sheet":"用語表","index":6,"n_rows":537,"n_cols":7,"rows_kept":537,"cut":false,"hidden":true,"merged":[[524,1,536,1],[513,0,536,0],[497,1,507,1],[508,1,512,1],[497,0,512,0],[513,1,523,1],[2,0,235,0],[236,0,335,0],[336,0,421,0],[422,0,452,0],[92,1,102,1],[103,1,119,1],[149,1,193,1],[120,1,148,1],[2,1,40,1],[41,1,70,1],[71,1,84,1],[85,1,91,1],[336,1,388,1],[389,1,421,1],[422,1,452,1],[194,1,235,1],[236,1,301,1],[302,1,335,1],[480,0,496,0],[480,1,496,1],[470,1,479,1],[453,0,479,0],[453,1,469,1]]}
[null,null,"ＩＴパスポート試験　　用語"]
[]
["コンピュータシステム","コンピュータ構成要素",1,"入力、制御、演算、記憶、出力の各機能のこと。","５大装置"]
[null,null,{"$f":"C3+1","v":2},"制御装置と演算装置をまとめたもの","ＣＰＵ","Central Processing Unit"]
[null,null,{"$f":"C4+1","v":3},"コンピュータの中核部である演算装置と制御装置を、１つの半導体チップに組み込んだもので、ＣＰＵと同じ意味で使用するもの。","マイクロプロセッサ"]
[null,null,{"$f":"C5+1","v":4},"プログラムを実行するとき、プログラムに書かれた命令をメモリに記憶するが、実行すべきプログラムをあらかじめメモリに記憶しておく方式。","プログラム内蔵方式"]
[null,null,5,"ＣＰＵがメモリから命令を１つずつ取り出して解釈し、演算を実行したり各装置に指令を送ったりする方式","逐次制御方式"]
[null,null,6,"コンピュータ内部で、ＣＰＵやメモリなどの各回路間で処理を進めるタイミングを取るための電気信号のこと。","クロック","clock frequency"]
[null,null,7,"プロセッサが１秒間に実行できる命令数","MIPS","Million Instructions Per Second"]
[null,null,8,"１命令の実行に要するクロック数","ＣＰＩ","Cycles Per Instruction"]
{"$rows_left_out":527}