{"text_format":"1","workbook":"xlsx","n_sheets":4,"sheets":["問題作成_説明中心","問題作成_説明中心 (2)","問題作成_用語中心","用語表"],"not_rendered":{"charts":0,"images":15,"macros":1,"external_links":0,"defined_names":0,"comments":0,"pivot_tables":0},"unopened":[],"bounds":{"document_bytes":16777216,"sheet_cells":100000,"rows_first":2000,"rows_last":500,"rows_between":2000,"halvings":0,"cell_chars":16384,"cell_head_chars":4096},"cells_cut":0,"cells_raw":0,"read":"whole","date_system":"1900"}

{"sheet":"問題作成_説明中心","index":0,"n_rows":189,"n_cols":14,"rows_kept":189,"cut":false,"hidden":false,"merged":[[39,1,39,8],[40,1,40,8],[0,1,0,10],[1,1,1,10],[37,1,37,8],[38,1,38,8],[48,4,54,11],[41,1,41,8],[42,1,42,8],[45,1,45,8],[46,1,46,8],[43,1,43,8],[44,1,44,8]]}
[null,"《1級》用語確認問題"]
[null,"　　　年　　　組　　　席　名前"]
[]
[1,{"$f":"VLOOKUP(A4,用語表!$B$3:$D$134,3)","v":"キャッシュメモリ"},null,{"$f":"A36+1","v":34},{"$f":"VLOOKUP(D4,用語表!$B$3:$D$134,3)","v":"UPS"},null,{"$f":"D36+1","v":67},{"$f":"VLOOKUP(G4,用語表!$B$3:$D$134,3)","v":"CGI"},null,{"$f":"G36+1","v":100},{"$f":"VLOOKUP(J4,用語表!$B$3:$D$134,3)","v":"SWOT分析（スウォット）"}]
[2,{"$f":"VLOOKUP(A5,用語表!$B$3:$D$134,3)","v":"ディスクキャッシュ"},null,{"$f":"D4+1","v":35},{"$f":"VLOOKUP(D5,用語表!$B$3:$D$134,3)","v":"RAID"},null,{"$f":"G4+1","v":68},{"$f":"VLOOKUP(G5,用語表!$B$3:$D$134,3)","v":"XML"},null,{"$f":"J4+1","v":101},{"$f":"VLOOKUP(J5,用語表!$B$3:$D$134,3)","v":"PPM分析"}]
[3,{"$f":"VLOOKUP(A6,用語表!$B$3:$D$134,3)","v":"デバイスドライバ"},null,{"$f":"D5+1","v":36},{"$f":"VLOOKUP(D6,用語表!$B$3:$D$134,3)","v":"OSI参照モデル"},null,{"$f":"G5+1","v":69},{"$f":"VLOOKUP(G6,用語表!$B$3:$D$134,3)","v":"Cookie"},null,{"$f":"J5+1","v":102},{"$f":"VLOOKUP(J6,用語表!$B$3:$D$134,3)","v":"ERP(経営資源計画)"}]
[4,{"$f":"VLOOKUP(A7,用語表!$B$3:$D$134,3)","v":"プラグアンドプレイ"},null,37,{"$f":"VLOOKUP(D7,用語表!$B$3:$D$134,3)","v":"ハブ"},null,70,{"$f":"VLOOKUP(G7,用語表!$B$3:$D$134,3)","v":"MIME"},null,103,{"$f":"VLOOKUP(J7,用語表!$B$3:$D$134,3)","v":"CRM(顧客関係管理)"}]
[5,{"$f":"VLOOKUP(A8,用語表!$B$3:$D$134,3)","v":"SSD"},null,38,{"$f":"VLOOKUP(D8,用語表!$B$3:$D$134,3)","v":"ルータ"},null,71,{"$f":"VLOOKUP(G8,用語表!$B$3:$D$134,3)","v":"VoIP"},null,104,{"$f":"VLOOKUP(J8,用語表!$B$3:$D$134,3)","v":"BPR(業務プロセス再設計)"}]
[6,{"$f":"VLOOKUP(A9,用語表!$B$3:$D$134,3)","v":"ウォータフォールモデル"},null,39,{"$f":"VLOOKUP(D9,用語表!$B$3:$D$134,3)","v":"パケットフィルタリング"},null,72,{"$f":"VLOOKUP(G9,用語表!$B$3:$D$134,3)","v":"共通鍵暗号方式"},null,105,{"$f":"VLOOKUP(J9,用語表!$B$3:$D$134,3)","v":"アウトソーシング"}]
[7,{"$f":"VLOOKUP(A10,用語表!$B$3:$D$134,3)","v":"プロトタイプモデル"},null,40,{"$f":"VLOOKUP(D10,用語表!$B$3:$D$134,3)","v":"ゲートウェイ"},null,73,{"$f":"VLOOKUP(G10,用語表!$B$3:$D$134,3)","v":"公開鍵暗号方式"},null,106,{"$f":"VLOOKUP(J10,用語表!$B$3:$D$134,3)","v":"アライアンス"}]
[8,{"$f":"VLOOKUP(A11,用語表!$B$3:$D$134,3)","v":"スパイラルモデル"},null,41,{"$f":"VLOOKUP(D11,用語表!$B$3:$D$134,3)","v":"プロトコル"},null,74,{"$f":"VLOOKUP(G11,用語表!$B$3:$D$134,3)","v":"電子署名（ディジタル署名）"},null,107,{"$f":"VLOOKUP(J11,用語表!$B$3:$D$134,3)","v":"ハウジングサービス"}]
[9,{"$f":"VLOOKUP(A12,用語表!$B$3:$D$134,3)","v":"基本設計"},null,42,{"$f":"VLOOKUP(D12,用語表!$B$3:$D$134,3)","v":"TCP/IP"},null,75,{"$f":"VLOOKUP(G12,用語表!$B$3:$D$134,3)","v":"認証局（CA)"},null,108,{"$f":"VLOOKUP(J12,用語表!$B$3:$D$134,3)","v":"ホスティングサービス"}]
[10,{"$f":"VLOOKUP(A13,用語表!$B$3:$D$134,3)","v":"外部設計"},null,43,{"$f":"VLOOKUP(D13,用語表!$B$3:$D$134,3)","v":"HTTP"},null,76,{"$f":"VLOOKUP(G13,用語表!$B$3:$D$134,3)","v":"SSL"},null,109,{"$f":"VLOOKUP(J13,用語表!$B$3:$D$134,3)","v":"排他制御"}]
[11,{"$f":"VLOOKUP(A14,用語表!$B$3:$D$134,3)","v":"内部設計"},null,44,{"$f":"VLOOKUP(D14,用語表!$B$3:$D$134,3)","v":"FTP"},null,77,{"$f":"VLOOKUP(G14,用語表!$B$3:$D$134,3)","v":"HTTPS"},null,110,{"$f":"VLOOKUP(J14,用語表!$B$3:$D$134,3)","v":"ロック"}]
[12,{"$f":"VLOOKUP(A15,用語表!$B$3:$D$134,3)","v":"プログラム設計"},null,45,{"$f":"VLOOKUP(D15,用語表!$B$3:$D$134,3)","v":"POP"},null,78,{"$f":"VLOOKUP(G15,用語表!$B$3:$D$134,3)","v":"ログファイル"},null,111,{"$f":"VLOOKUP(J15,用語表!$B$3:$D$134,3)","v":"共有ロック"}]
[13,{"$f":"VLOOKUP(A16,用語表!$B$3:$D$134,3)","v":"プログラミング"},null,46,{"$f":"VLOOKUP(D16,用語表!$B$3:$D$134,3)","v":"SMTP"},null,79,{"$f":"VLOOKUP(G16,用語表!$B$3:$D$134,3)","v":"システムログ"},null,112,{"$f":"VLOOKUP(J16,用語表!$B$3:$D$134,3)","v":"占有ロック"}]
[14,{"$f":"VLOOKUP(A17,用語表!$B$3:$D$134,3)","v":"テスト"},null,47,{"$f":"VLOOKUP(D17,用語表!$B$3:$D$134,3)","v":"DHCP"},null,80,{"$f":"VLOOKUP(G17,用語表!$B$3:$D$134,3)","v":"アクセスログ"},null,113,{"$f":"VLOOKUP(J17,用語表!$B$3:$D$134,3)","v":"デッドロック"}]
[15,{"$f":"VLOOKUP(A18,用語表!$B$3:$D$134,3)","v":"単体テスト"},null,48,{"$f":"VLOOKUP(D18,用語表!$B$3:$D$134,3)","v":"MACアドレス"},null,81,{"$f":"VLOOKUP(G18,用語表!$B$3:$D$134,3)","v":"ブレーンストーミング"},null,114,{"$f":"VLOOKUP(J18,用語表!$B$3:$D$134,3)","v":"トランザクション"}]
[16,{"$f":"VLOOKUP(A19,用語表!$B$3:$D$134,3)","v":"結合テスト"},null,49,{"$f":"VLOOKUP(D19,用語表!$B$3:$D$134,3)","v":"IPアドレス"},null,82,{"$f":"VLOOKUP(G19,用語表!$B$3:$D$134,3)","v":"KJ法"},null,115,{"$f":"VLOOKUP(J19,用語表!$B$3:$D$134,3)","v":"コミット"}]
[17,{"$f":"VLOOKUP(A20,用語表!$B$3:$D$134,3)","v":"システムテスト"},null,50,{"$f":"VLOOKUP(D20,用語表!$B$3:$D$134,3)","v":"プライベートIPアドレス"},null,83,{"$f":"VLOOKUP(G20,用語表!$B$3:$D$134,3)","v":"決定表（デシジョンテーブル）"},null,116,{"$f":"VLOOKUP(J20,用語表!$B$3:$D$134,3)","v":"ジャーナルファイル"}]
[18,{"$f":"VLOOKUP(A21,用語表!$B$3:$D$134,3)","v":"保守・管理"},null,51,{"$f":"VLOOKUP(D21,用語表!$B$3:$D$134,3)","v":"グローバルIPアドレス"},null,84,{"$f":"VLOOKUP(G21,用語表!$B$3:$D$134,3)","v":"DFD"},null,117,{"$f":"VLOOKUP(J21,用語表!$B$3:$D$134,3)","v":"チェックポイント"}]
[19,{"$f":"VLOOKUP(A22,用語表!$B$3:$D$134,3)","v":"ブラックボックステスト"},null,52,{"$f":"VLOOKUP(D22,用語表!$B$3:$D$134,3)","v":"サブネットマスク"},null,85,{"$f":"VLOOKUP(G22,用語表!$B$3:$D$134,3)","v":"パート図（PERT)"},null,118,{"$f":"VLOOKUP(J22,用語表!$B$3:$D$134,3)","v":"ロールバック"}]
[20,{"$f":"VLOOKUP(A23,用語表!$B$3:$D$134,3)","v":"ホワイトボックステスト"},null,53,{"$f":"VLOOKUP(D23,用語表!$B$3:$D$134,3)","v":"ネットワークアドレス"},null,86,{"$f":"VLOOKUP(G23,用語表!$B$3:$D$134,3)","v":"クリティカルパス"},null,119,{"$f":"VLOOKUP(J23,用語表!$B$3:$D$134,3)","v":"ロールフォワード"}]
[21,{"$f":"VLOOKUP(A24,用語表!$B$3:$D$134,3)","v":"RASIS"},null,54,{"$f":"VLOOKUP(D24,用語表!$B$3:$D$134,3)","v":"ホストアドレス"},null,87,{"$f":"VLOOKUP(G24,用語表!$B$3:$D$134,3)","v":"ABC分析"},null,120,{"$f":"VLOOKUP(J24,用語表!$B$3:$D$134,3)","v":"概念設計"}]
[22,{"$f":"VLOOKUP(A25,用語表!$B$3:$D$134,3)","v":"稼働率"},null,55,{"$f":"VLOOKUP(D25,用語表!$B$3:$D$134,3)","v":"NAT"},null,88,{"$f":"VLOOKUP(G25,用語表!$B$3:$D$134,3)","v":"パレード図"},null,121,{"$f":"VLOOKUP(J25,用語表!$B$3:$D$134,3)","v":"論理設計"}]
[23,{"$f":"VLOOKUP(A26,用語表!$B$3:$D$134,3)","v":"平均故障間隔（MTBF)"},null,56,{"$f":"VLOOKUP(D26,用語表!$B$3:$D$134,3)","v":"DMZ"},null,89,{"$f":"VLOOKUP(G26,用語表!$B$3:$D$134,3)","v":"Zグラフ"},null,122,{"$f":"VLOOKUP(J26,用語表!$B$3:$D$134,3)","v":"物理設計"}]
[24,{"$f":"VLOOKUP(A27,用語表!$B$3:$D$134,3)","v":"平均修復時間（MTTR)"},null,57,{"$f":"VLOOKUP(D27,用語表!$B$3:$D$134,3)","v":"DNSサーバ"},null,90,{"$f":"VLOOKUP(G27,用語表!$B$3:$D$134,3)","v":"回帰分析"},null,123,{"$f":"VLOOKUP(J27,用語表!$B$3:$D$134,3)","v":"非正規形"}]
[25,{"$f":"VLOOKUP(A28,用語表!$B$3:$D$134,3)","v":"スループット"},null,58,{"$f":"VLOOKUP(D28,用語表!$B$3:$D$134,3)","v":"POPサーバ"},null,91,{"$f":"VLOOKUP(G28,用語表!$B$3:$D$134,3)","v":"散布図"},null,124,{"$f":"VLOOKUP(J28,用語表!$B$3:$D$134,3)","v":"第１正規化（正規形）"}]
[26,{"$f":"VLOOKUP(A29,用語表!$B$3:$D$134,3)","v":"レスポンスタイム"},null,59,{"$f":"VLOOKUP(D29,用語表!$B$3:$D$134,3)","v":"SMTPサーバ"},null,92,{"$f":"VLOOKUP(G29,用語表!$B$3:$D$134,3)","v":"正の相関"},null,125,{"$f":"VLOOKUP(J29,用語表!$B$3:$D$134,3)","v":"第２正規化（正規形）"}]
[27,{"$f":"VLOOKUP(A30,用語表!$B$3:$D$134,3)","v":"ターンアラウンドタイム"},null,60,{"$f":"VLOOKUP(D30,用語表!$B$3:$D$134,3)","v":"DHCPサーバ"},null,93,{"$f":"VLOOKUP(G30,用語表!$B$3:$D$134,3)","v":"負の相関"},null,126,{"$f":"VLOOKUP(J30,用語表!$B$3:$D$134,3)","v":"第３正規化（正規形）"}]
{"$rows_left_out":160}
{"sheet":"問題作成_説明中心 (2)","index":1,"n_rows":189,"n_cols":14,"rows_kept":189,"cut":false,"hidden":false,"merged":[[48,4,54,11],[11,1,11,2],[16,1,16,2],[41,1,41,8],[42,1,42,8],[43,1,43,8],[44,1,44,8],[45,1,45,8],[46,1,46,8],[40,1,40,8],[0,1,0,10],[1,1,1,10],[37,1,37,8],[38,1,38,8],[39,1,39,8]]}
[null,"《1級》用語確認問題"]
[null,"　　　年　　　組　　　席　名前"]
[]
[133,{"$f":"VLOOKUP(A4,用語表!$B$3:$D$164,3)","v":"CEILING　（シーリング）"}]
[{"$f":"A4+1","v":134},{"$f":"VLOOKUP(A5,用語表!$B$3:$D$164,3)","v":"FLOOR　（フロア）"}]
[{"$f":"A5+1","v":135},{"$f":"VLOOKUP(A6,用語表!$B$3:$D$164,3)","v":"ABS"}]
[136,{"$f":"VLOOKUP(A7,用語表!$B$3:$D$164,3)","v":"RAND"}]
[137,{"$f":"VLOOKUP(A8,用語表!$B$3:$D$164,3)","v":"SUBTOTAL"}]
[138,{"$f":"VLOOKUP(A9,用語表!$B$3:$D$164,3)","v":"SUMIFS"}]
[139,{"$f":"VLOOKUP(A10,用語表!$B$3:$D$164,3)","v":"AVERAGEIFS"}]
[140,{"$f":"VLOOKUP(A11,用語表!$B$3:$D$164,3)","v":"CONTIFS"}]
[141,{"$f":"VLOOKUP(A12,用語表!$B$3:$D$164,3)","v":"FORECAST　（フォーキャスト）"}]
[142,{"$f":"VLOOKUP(A13,用語表!$B$3:$D$164,3)","v":"MEDIAN　（メジアン）"}]
[143,{"$f":"VLOOKUP(A14,用語表!$B$3:$D$164,3)","v":"MODE　（モード）"}]
[144,{"$f":"VLOOKUP(A15,用語表!$B$3:$D$164,3)","v":"ROW　　（ロウ）"}]
[145,{"$f":"VLOOKUP(A16,用語表!$B$3:$D$164,3)","v":"COLUMN　（コラム）"}]
[146,{"$f":"VLOOKUP(A17,用語表!$B$3:$D$164,3)","v":"SUBSTITUTE　（サブスティテュート）"}]
[147,{"$f":"VLOOKUP(A18,用語表!$B$3:$D$164,3)","v":"DSUM"}]
[148,{"$f":"VLOOKUP(A19,用語表!$B$3:$D$164,3)","v":"DAVERAGE"}]
[149,{"$f":"VLOOKUP(A20,用語表!$B$3:$D$164,3)","v":"DMAX"}]
[150,{"$f":"VLOOKUP(A21,用語表!$B$3:$D$164,3)","v":"DMIN"}]
[151,{"$f":"VLOOKUP(A22,用語表!$B$3:$D$164,3)","v":"DCOUNT"}]
[152,{"$f":"VLOOKUP(A23,用語表!$B$3:$D$164,3)","v":"DCOUNTA"}]
[153,{"$f":"VLOOKUP(A24,用語表!$B$3:$D$164,3)","v":"INSERT INTO ～ VALUES ～"}]
[154,{"$f":"VLOOKUP(A25,用語表!$B$3:$D$164,3)","v":"UPDATE ～ SET ～ WHERE～"}]
[155,{"$f":"VLOOKUP(A26,用語表!$B$3:$D$164,3)","v":"DELETE FROM ～ WHERE ～"}]
[156,{"$f":"VLOOKUP(A27,用語表!$B$3:$D$164,3)","v":"DISTINCT"}]
[157,{"$f":"VLOOKUP(A28,用語表!$B$3:$D$164,3)","v":"LIKE (ワイルドカード % _)"}]
[158,{"$f":"VLOOKUP(A29,用語表!$B$3:$D$164,3)","v":"ORDER BY (ASC  DESC)"}]
[159,{"$f":"VLOOKUP(A30,用語表!$B$3:$D$164,3)","v":"GROUP BY (HAVING)"}]
{"$rows_left_out":160}
{"sheet":"問題作成_用語中心","index":2,"n_rows":177,"n_cols":14,"rows_kept":177,"cut":false,"hidden":false,"merged":[[48,5,54,11],[40,2,40,5],[39,2,39,5],[0,2,0,11],[1,2,1,11],[37,2,37,5],[38,2,38,5],[42,2,42,5],[41,2,41,5],[46,2,46,5],[45,2,45,5],[44,2,44,5],[43,2,43,5]]}
[null,null,"《1級》用語確認問題"]
[null,null,"　　　年　　　組　　　席　名前"]
[]
[null,1,{"$f":"VLOOKUP(B4,用語表!$B$3:$D$134,3)","v":"キャッシュメモリ"},null,{"$f":"B36+1","v":34},{"$f":"VLOOKUP(E4,用語表!$B$3:$D$134,3)","v":"UPS"},null,{"$f":"E36+1","v":67},{"$f":"VLOOKUP(H4,用語表!$B$3:$D$134,3)","v":"CGI"},null,{"$f":"H36+1","v":100},{"$f":"VLOOKUP(K4,用語表!$B$3:$D$134,3)","v":"SWOT分析（スウォット）"}]
[null,2,{"$f":"VLOOKUP(B5,用語表!$B$3:$D$134,3)","v":"ディスクキャッシュ"},null,{"$f":"E4+1","v":35},{"$f":"VLOOKUP(E5,用語表!$B$3:$D$134,3)","v":"RAID"},null,{"$f":"H4+1","v":68},{"$f":"VLOOKUP(H5,用語表!$B$3:$D$134,3)","v":"XML"},null,{"$f":"K4+1","v":101},{"$f":"VLOOKUP(K5,用語表!$B$3:$D$134,3)","v":"PPM分析"}]
[null,3,{"$f":"VLOOKUP(B6,用語表!$B$3:$D$134,3)","v":"デバイスドライバ"},null,{"$f":"E5+1","v":36},{"$f":"VLOOKUP(E6,用語表!$B$3:$D$134,3)","v":"OSI参照モデル"},null,{"$f":"H5+1","v":69},{"$f":"VLOOKUP(H6,用語表!$B$3:$D$134,3)","v":"Cookie"},null,{"$f":"K5+1","v":102},{"$f":"VLOOKUP(K6,用語表!$B$3:$D$134,3)","v":"ERP(経営資源計画)"}]
[null,4,{"$f":"VLOOKUP(B7,用語表!$B$3:$D$134,3)","v":"プラグアンドプレイ"},null,37,{"$f":"VLOOKUP(E7,用語表!$B$3:$D$134,3)","v":"ハブ"},null,70,{"$f":"VLOOKUP(H7,用語表!$B$3:$D$134,3)","v":"MIME"},null,103,{"$f":"VLOOKUP(K7,用語表!$B$3:$D$134,3)","v":"CRM(顧客関係管理)"}]
[null,5,{"$f":"VLOOKUP(B8,用語表!$B$3:$D$134,3)","v":"SSD"},null,38,{"$f":"VLOOKUP(E8,用語表!$B$3:$D$134,3)","v":"ルータ"},null,71,{"$f":"VLOOKUP(H8,用語表!$B$3:$D$134,3)","v":"VoIP"},null,104,{"$f":"VLOOKUP(K8,用語表!$B$3:$D$134,3)","v":"BPR(業務プロセス再設計)"}]
[null,6,{"$f":"VLOOKUP(B9,用語表!$B$3:$D$134,3)","v":"ウォータフォールモデル"},null,39,{"$f":"VLOOKUP(E9,用語表!$B$3:$D$134,3)","v":"パケットフィルタリング"},null,72,{"$f":"VLOOKUP(H9,用語表!$B$3:$D$134,3)","v":"共通鍵暗号方式"},null,105,{"$f":"VLOOKUP(K9,用語表!$B$3:$D$134,3)","v":"アウトソーシング"}]
[null,7,{"$f":"VLOOKUP(B10,用語表!$B$3:$D$134,3)","v":"プロトタイプモデル"},null,40,{"$f":"VLOOKUP(E10,用語表!$B$3:$D$134,3)","v":"ゲートウェイ"},null,73,{"$f":"VLOOKUP(H10,用語表!$B$3:$D$134,3)","v":"公開鍵暗号方式"},null,106,{"$f":"VLOOKUP(K10,用語表!$B$3:$D$134,3)","v":"アライアンス"}]
[null,8,{"$f":"VLOOKUP(B11,用語表!$B$3:$D$134,3)","v":"スパイラルモデル"},null,41,{"$f":"VLOOKUP(E11,用語表!$B$3:$D$134,3)","v":"プロトコル"},null,74,{"$f":"VLOOKUP(H11,用語表!$B$3:$D$134,3)","v":"電子署名（ディジタル署名）"},null,107,{"$f":"VLOOKUP(K11,用語表!$B$3:$D$134,3)","v":"ハウジングサービス"}]
[null,9,{"$f":"VLOOKUP(B12,用語表!$B$3:$D$134,3)","v":"基本設計"},null,42,{"$f":"VLOOKUP(E12,用語表!$B$3:$D$134,3)","v":"TCP/IP"},null,75,{"$f":"VLOOKUP(H12,用語表!$B$3:$D$134,3)","v":"認証局（CA)"},null,108,{"$f":"VLOOKUP(K12,用語表!$B$3:$D$134,3)","v":"ホスティングサービス"}]
[null,10,{"$f":"VLOOKUP(B13,用語表!$B$3:$D$134,3)","v":"外部設計"},null,43,{"$f":"VLOOKUP(E13,用語表!$B$3:$D$134,3)","v":"HTTP"},null,76,{"$f":"VLOOKUP(H13,用語表!$B$3:$D$134,3)","v":"SSL"},null,109,{"$f":"VLOOKUP(K13,用語表!$B$3:$D$134,3)","v":"排他制御"}]
[null,11,{"$f":"VLOOKUP(B14,用語表!$B$3:$D$134,3)","v":"内部設計"},null,44,{"$f":"VLOOKUP(E14,用語表!$B$3:$D$134,3)","v":"FTP"},null,77,{"$f":"VLOOKUP(H14,用語表!$B$3:$D$134,3)","v":"HTTPS"},null,110,{"$f":"VLOOKUP(K14,用語表!$B$3:$D$134,3)","v":"ロック"}]
[null,12,{"$f":"VLOOKUP(B15,用語表!$B$3:$D$134,3)","v":"プログラム設計"},null,45,{"$f":"VLOOKUP(E15,用語表!$B$3:$D$134,3)","v":"POP"},null,78,{"$f":"VLOOKUP(H15,用語表!$B$3:$D$134,3)","v":"ログファイル"},null,111,{"$f":"VLOOKUP(K15,用語表!$B$3:$D$134,3)","v":"共有ロック"}]
[null,13,{"$f":"VLOOKUP(B16,用語表!$B$3:$D$134,3)","v":"プログラミング"},null,46,{"$f":"VLOOKUP(E16,用語表!$B$3:$D$134,3)","v":"SMTP"},null,79,{"$f":"VLOOKUP(H16,用語表!$B$3:$D$134,3)","v":"システムログ"},null,112,{"$f":"VLOOKUP(K16,用語表!$B$3:$D$134,3)","v":"占有ロック"}]
[null,14,{"$f":"VLOOKUP(B17,用語表!$B$3:$D$134,3)","v":"テスト"},null,47,{"$f":"VLOOKUP(E17,用語表!$B$3:$D$134,3)","v":"DHCP"},null,80,{"$f":"VLOOKUP(H17,用語表!$B$3:$D$134,3)","v":"アクセスログ"},null,113,{"$f":"VLOOKUP(K17,用語表!$B$3:$D$134,3)","v":"デッドロック"}]
[null,15,{"$f":"VLOOKUP(B18,用語表!$B$3:$D$134,3)","v":"単体テスト"},null,48,{"$f":"VLOOKUP(E18,用語表!$B$3:$D$134,3)","v":"MACアドレス"},null,81,{"$f":"VLOOKUP(H18,用語表!$B$3:$D$134,3)","v":"ブレーンストーミング"},null,114,{"$f":"VLOOKUP(K18,用語表!$B$3:$D$134,3)","v":"トランザクション"}]
[null,16,{"$f":"VLOOKUP(B19,用語表!$B$3:$D$134,3)","v":"結合テスト"},null,49,{"$f":"VLOOKUP(E19,用語表!$B$3:$D$134,3)","v":"IPアドレス"},null,82,{"$f":"VLOOKUP(H19,用語表!$B$3:$D$134,3)","v":"KJ法"},null,115,{"$f":"VLOOKUP(K19,用語表!$B$3:$D$134,3)","v":"コミット"}]
[null,17,{"$f":"VLOOKUP(B20,用語表!$B$3:$D$134,3)","v":"システムテスト"},null,50,{"$f":"VLOOKUP(E20,用語表!$B$3:$D$134,3)","v":"プライベートIPアドレス"},null,83,{"$f":"VLOOKUP(H20,用語表!$B$3:$D$134,3)","v":"決定表（デシジョンテーブル）"},null,116,{"$f":"VLOOKUP(K20,用語表!$B$3:$D$134,3)","v":"ジャーナルファイル"}]
[null,18,{"$f":"VLOOKUP(B21,用語表!$B$3:$D$134,3)","v":"保守・管理"},null,51,{"$f":"VLOOKUP(E21,用語表!$B$3:$D$134,3)","v":"グローバルIPアドレス"},null,84,{"$f":"VLOOKUP(H21,用語表!$B$3:$D$134,3)","v":"DFD"},null,117,{"$f":"VLOOKUP(K21,用語表!$B$3:$D$134,3)","v":"チェックポイント"}]
[null,19,{"$f":"VLOOKUP(B22,用語表!$B$3:$D$134,3)","v":"ブラックボックステスト"},null,52,{"$f":"VLOOKUP(E22,用語表!$B$3:$D$134,3)","v":"サブネットマスク"},null,85,{"$f":"VLOOKUP(H22,用語表!$B$3:$D$134,3)","v":"パート図（PERT)"},null,118,{"$f":"VLOOKUP(K22,用語表!$B$3:$D$134,3)","v":"ロールバック"}]
[null,20,{"$f":"VLOOKUP(B23,用語表!$B$3:$D$134,3)","v":"ホワイトボックステスト"},null,53,{"$f":"VLOOKUP(E23,用語表!$B$3:$D$134,3)","v":"ネットワークアドレス"},null,86,{"$f":"VLOOKUP(H23,用語表!$B$3:$D$134,3)","v":"クリティカルパス"},null,119,{"$f":"VLOOKUP(K23,用語表!$B$3:$D$134,3)","v":"ロールフォワード"}]
[null,21,{"$f":"VLOOKUP(B24,用語表!$B$3:$D$134,3)","v":"RASIS"},null,54,{"$f":"VLOOKUP(E24,用語表!$B$3:$D$134,3)","v":"ホストアドレス"},null,87,{"$f":"VLOOKUP(H24,用語表!$B$3:$D$134,3)","v":"ABC分析"},null,120,{"$f":"VLOOKUP(K24,用語表!$B$3:$D$134,3)","v":"概念設計"}]
[null,22,{"$f":"VLOOKUP(B25,用語表!$B$3:$D$134,3)","v":"稼働率"},null,55,{"$f":"VLOOKUP(E25,用語表!$B$3:$D$134,3)","v":"NAT"},null,88,{"$f":"VLOOKUP(H25,用語表!$B$3:$D$134,3)","v":"パレード図"},null,121,{"$f":"VLOOKUP(K25,用語表!$B$3:$D$134,3)","v":"論理設計"}]
[null,23,{"$f":"VLOOKUP(B26,用語表!$B$3:$D$134,3)","v":"平均故障間隔（MTBF)"},null,56,{"$f":"VLOOKUP(E26,用語表!$B$3:$D$134,3)","v":"DMZ"},null,89,{"$f":"VLOOKUP(H26,用語表!$B$3:$D$134,3)","v":"Zグラフ"},null,122,{"$f":"VLOOKUP(K26,用語表!$B$3:$D$134,3)","v":"物理設計"}]
[null,24,{"$f":"VLOOKUP(B27,用語表!$B$3:$D$134,3)","v":"平均修復時間（MTTR)"},null,57,{"$f":"VLOOKUP(E27,用語表!$B$3:$D$134,3)","v":"DNSサーバ"},null,90,{"$f":"VLOOKUP(H27,用語表!$B$3:$D$134,3)","v":"回帰分析"},null,123,{"$f":"VLOOKUP(K27,用語表!$B$3:$D$134,3)","v":"非正規形"}]
[null,25,{"$f":"VLOOKUP(B28,用語表!$B$3:$D$134,3)","v":"スループット"},null,58,{"$f":"VLOOKUP(E28,用語表!$B$3:$D$134,3)","v":"POPサーバ"},null,91,{"$f":"VLOOKUP(H28,用語表!$B$3:$D$134,3)","v":"散布図"},null,124,{"$f":"VLOOKUP(K28,用語表!$B$3:$D$134,3)","v":"第１正規化（正規形）"}]
[null,26,{"$f":"VLOOKUP(B29,用語表!$B$3:$D$134,3)","v":"レスポンスタイム"},null,59,{"$f":"VLOOKUP(E29,用語表!$B$3:$D$134,3)","v":"SMTPサーバ"},null,92,{"$f":"VLOOKUP(H29,用語表!$B$3:$D$134,3)","v":"正の相関"},null,125,{"$f":"VLOOKUP(K29,用語表!$B$3:$D$134,3)","v":"第２正規化（正規形）"}]
[null,27,{"$f":"VLOOKUP(B30,用語表!$B$3:$D$134,3)","v":"ターンアラウンドタイム"},null,60,{"$f":"VLOOKUP(E30,用語表!$B$3:$D$134,3)","v":"DHCPサーバ"},null,93,{"$f":"VLOOKUP(H30,用語表!$B$3:$D$134,3)","v":"負の相関"},null,126,{"$f":"VLOOKUP(K30,用語表!$B$3:$D$134,3)","v":"第３正規化（正規形）"}]
{"$rows_left_out":148}
{"sheet":"用語表","index":3,"n_rows":164,"n_cols":6,"rows_kept":164,"cut":false,"hidden":true,"merged":[[134,0,147,0],[148,0,153,0],[154,0,163,0],[110,0,133,0],[82,0,109,0],[73,0,81,0],[2,0,6,0],[7,0,21,0],[22,0,36,0],[37,0,65,0],[66,0,72,0]]}
["全商情報処理検定1級　ビジネス情報部門　　用語"]
[]
["コンピュータの\n構成",1,"CPUと主記憶装置の間にあり、主記憶装置よりも高速なデータ転送が可能なメモリのこと。使用頻度の高いデータを蓄えておき、低速な装置から何度も読み出す無駄を省ける。","キャッシュメモリ","cache memory     *cache:貯蔵品"]
[null,2,"ハードディスクなど低速な機器に記憶されているデータを、メモリ（RAM）に格納すること。または、その格納されたメモリの領域。ハードディスクなどの補助記憶装置と主記憶装置の間にあり、補助記憶装置よりも高速なデータ転送が可能なメモリのこと。使用頻度の高いデータを蓄えておき、低速な装置から何度も読み出す無駄を省ける。","ディスクキャッシュ","disk cache"]
[null,3,"コンピュータに接続して使用するプリンタなどの周辺機器を動作させるためのソフトウェア。","デバイスドライバ","device driver       *driver:操縦者",1]
[null,4,"コンピュータに新しいハードウェアを追加するときなど、必要な設定をユーザが手動で設定作業をしなくても、OSが最適な設定を行うシステム。","プラグアンドプレイ",null,1]
[null,5,"HDD(ハードディスクドライブ）に比べて軽量小型で読み書き速度も速く、電力の消費も少ない。半導体メモリ（フラッシュメモリ）を使用した記憶装置。","SSD"]
["システム開発と運用",6,"基本設計→外部設計→内部設計→プログラム設計→プログラミング→テストの順番で開発を進めていく。工程の全体像がつかみやすいので大規模なシステム開発に向いている。","ウォータフォールモデル","waterfall model"]
[null,7,"開発の早い段階から試作品を作成して試用してもらい、ユーザの要求を確認しながら開発を進めるシステム開発手法。比較的小規模なシステムの開発に向いている。","プロトタイプモデル","prototype model"]
[null,8,"プロトタイプモデルとウォータフォールモデルを合わせた開発手法。独立性の高いプログラムごとに、設計→プログラミング→テストをユーザの要求に合うまで繰り返す。","スパイラルモデル","spiral model"]
[null,9,"ユーザと開発者が十分話し合い、ユーザからの要件をどのようにシステムとして実現できるかを判断した上で、システムに要求される機能を決定する開発工程。","基本設計","basic design"]
[null,10,"システム開発において、画面や帳票などを利用者側の視点から設計する開発工程。インターフェイスなどをユーザにとって使い勝手のよいシステムになるよう目指すための工程。","外部設計","external design"]
[null,11,"外部設計で決定した機能を実現するために、プログラムの詳細な機能を洗い出し、それぞれの機能を実現するための処理手順やデータの設計を行う開発工程。ソフトウェアのアルゴリズムや入出力データなどを詳細に設計する開発工程。","内部設計","internal design"]
[null,12,"内部設計に基づいて、各プログラムの内部構造を設計する開発工程。外部設計と内部設計の機能を、プログラムにより実現する方法を設計する工程。","プログラム設計","program design"]
[null,13,"プログラム設計の結果を受けて、プログラム言語を用いて実際にプログラムを作成（コーディング）する開発工程。","プログラミング","programing"]
[null,14,"開発者だけではなくユーザも参加して、作成したそれぞれのプログラムが設計したとおりに正しく動作するかを確かめ、プログラムの品質を高めること。","テスト","test"]
[null,15,"システムのテスト手法の一つで、個々のプログラム（部品）が仕様書の要求通りに機能しているかを確認するテスト。","単体テスト","unit test"]
[null,16,"システムのテスト手法の一つで、複数のモジュール(部品）を組み合わせて、モジュール間でデータの受け渡しが設計通りに行われているかなどを確認するテスト。","結合テスト","integration test"]
[null,17,"開発したシステム全体が、設計通りの機能を備えているかを確認するテストのこと。","システムテスト","system test"]
[null,18,"開発したシステムのユーザによる運用中のプログラムの欠陥などを修復する作業と、システム運用時にシステムの効率的な稼動を目的に実施する業務のこと。","保守・管理"]
[null,19,"システムの内部構造とは無関係に、外部から見た機能を検証するテスト方法。入力と出力だけに着目し、様々な入力に対して仕様書通りの出力が得られるか確認する。","ブラックボックステスト","brack box test"]
[null,20,"システム内部の構造を理解した上で、それら一つ一つが設計した通りに動作しているかを確認するプログラムのテスト方法。","ホワイトボックステスト","white box test"]
["性能・障害管理",21,"コンピュータシステムの信頼性を評価するときのチェック項目を示すもので、信頼性・可用性・保守性・保全性・機密性の5つの単語の頭文字を集めたもの。","RASIS","Reliability Availability Serviceability Intergrity Security"]
[null,22,"システムが目標とする稼動時間に対し、正常に稼動した時間の割合（確率）。","稼働率","availability"]
[null,23,"システムが故障してから復旧し、次に故障するまでの平均時間。すなわちシステムが正常に稼動している時間を平均で表したもの。","平均故障間隔（MTBF)","Mean Time Between Faliure"]
[null,24,"システムの障害発生時における修復時間の平均。この時間が短いほど保守性に優れている。","平均修復時間（MTTR)","Mean Time To Repair"]
[null,25,"コンピュータシステムや通信回線が、一定の時間内に処理できる仕事量や伝送できる情報量。","スループット","throughput"]
[null,26,"コンピュータシステムに処理実行の指示を出してから、最初の応答を得るまでの時間。","レスポンスタイム","response time"]
[null,27,"コンピュータシステムにに処理実行の指示を出してから、すべての実行結果が得られるまでの時間。","ターンアラウンドタイム","turn around time"]
[null,28,"事前に予備のシステムを準備しておき、障害が発生しても対応できるようにするシステム。","フォールトトレラント","fault-tolerance "]
{"$rows_left_out":134}